e1000e: Fix build with ust trace backend

ust trace backend has limitation of maximum 10
arguments per event. Traces with more arguments
cannot be compiled for this backend.

Trace e1000e_rx_rss_ip6 introduced by previous
commits has 11 arguments and fails to compile with
ust trace backend.

This patch fixes the problem by splitting this
tracepoint into two successive tracepoints with
smaller number of arguments.

For more information see comment regarding TP_ARGS
in lttng/tracepoint.h:

/*
* TP_ARGS takes tuples of type, argument separated by a comma.
* It can take up to 10 tuples (which means that less than 10 tuples is
* fine too).
* Each tuple is also separated by a comma.
*/

Build log generated by this problem:

In file included from ./trace/generated-tracers.h:9:0,
                 from /home/travis/build/qemu/qemu/include/trace.h:4,
                 from util/oslib-posix.c:36:
./trace/generated-ust-provider.h:16556:3: error: unknown type name ‘_TP_EXPROTO_Bool’
In file included from /home/travis/build/qemu/qemu/include/trace.h:4:0,
                 from util/oslib-posix.c:36:
./trace/generated-tracers.h: In function ‘trace_e1000e_rx_rss_ip6’:
./trace/generated-tracers.h:8379:431: error: expected string literal before ‘_SDT_ASM_OPERANDS_ipv6_enabled’
./trace/generated-tracers.h:8379:431: error: implicit declaration of function ‘__tracepoint_cb_qemu___e1000e_rx_rss_ip6’ [-Werror=implicit-function-declaration]
./trace/generated-tracers.h:8379:431: error: nested extern declaration of ‘__tracepoint_cb_qemu___e1000e_rx_rss_ip6’ [-Werror=nested-externs]
cc1: all warnings being treated as errors
make: *** [util/oslib-posix.o] Error 1
make: *** Waiting for unfinished jobs....
In file included from ./trace/generated-tracers.h:9:0,
                 from /home/travis/build/qemu/qemu/include/trace.h:4,
                 from util/hbitmap.c:16:
./trace/generated-ust-provider.h:16556:3: error: unknown type name ‘_TP_EXPROTO_Bool’
In file included from /home/travis/build/qemu/qemu/include/trace.h:4:0,
                 from util/hbitmap.c:16:
./trace/generated-tracers.h: In function ‘trace_e1000e_rx_rss_ip6’:
./trace/generated-tracers.h:8379:431: error: expected string literal before ‘_SDT_ASM_OPERANDS_ipv6_enabled’
./trace/generated-tracers.h:8379:431: error: implicit declaration of function ‘__tracepoint_cb_qemu___e1000e_rx_rss_ip6’ [-Werror=implicit-function-declaration]
./trace/generated-tracers.h:8379:431: error: nested extern declaration of ‘__tracepoint_cb_qemu___e1000e_rx_rss_ip6’ [-Werror=nested-externs]
cc1: all warnings being treated as errors
make: *** [util/hbitmap.o] Error 1

Signed-off-by: Dmitry Fleytman <dmitry@daynix.com>
Message-id: 1464894748-27803-1-git-send-email-dmitry@daynix.com
Signed-off-by: Peter Maydell <peter.maydell@linaro.org>
2 files changed
tree: 198853980b9902bddbc8ad7913661a45e4e3e371
  1. audio/
  2. backends/
  3. block/
  4. bsd-user/
  5. contrib/
  6. crypto/
  7. default-configs/
  8. disas/
  9. docs/
  10. fpu/
  11. fsdev/
  12. gdb-xml/
  13. hw/
  14. include/
  15. io/
  16. libdecnumber/
  17. linux-headers/
  18. linux-user/
  19. migration/
  20. nbd/
  21. net/
  22. pc-bios/
  23. po/
  24. qapi/
  25. qga/
  26. qobject/
  27. qom/
  28. replay/
  29. roms/
  30. scripts/
  31. slirp/
  32. stubs/
  33. target-alpha/
  34. target-arm/
  35. target-cris/
  36. target-i386/
  37. target-lm32/
  38. target-m68k/
  39. target-microblaze/
  40. target-mips/
  41. target-moxie/
  42. target-openrisc/
  43. target-ppc/
  44. target-s390x/
  45. target-sh4/
  46. target-sparc/
  47. target-tilegx/
  48. target-tricore/
  49. target-unicore32/
  50. target-xtensa/
  51. tcg/
  52. tests/
  53. trace/
  54. ui/
  55. util/
  56. .dir-locals.el
  57. .exrc
  58. .gitignore
  59. .gitmodules
  60. .mailmap
  61. .travis.yml
  62. accel.c
  63. aio-posix.c
  64. aio-win32.c
  65. arch_init.c
  66. async.c
  67. balloon.c
  68. block.c
  69. blockdev-nbd.c
  70. blockdev.c
  71. blockjob.c
  72. bootdevice.c
  73. bt-host.c
  74. bt-vhci.c
  75. Changelog
  76. CODING_STYLE
  77. configure
  78. COPYING
  79. COPYING.LIB
  80. cpu-exec-common.c
  81. cpu-exec.c
  82. cpus.c
  83. cputlb.c
  84. device-hotplug.c
  85. device_tree.c
  86. disas.c
  87. dma-helpers.c
  88. dump.c
  89. exec.c
  90. gdbstub.c
  91. HACKING
  92. hmp-commands-info.hx
  93. hmp-commands.hx
  94. hmp.c
  95. hmp.h
  96. iohandler.c
  97. ioport.c
  98. iothread.c
  99. kvm-all.c
  100. kvm-stub.c
  101. LICENSE
  102. main-loop.c
  103. MAINTAINERS
  104. Makefile
  105. Makefile.objs
  106. Makefile.target
  107. memory.c
  108. memory_mapping.c
  109. module-common.c
  110. monitor.c
  111. numa.c
  112. os-posix.c
  113. os-win32.c
  114. page_cache.c
  115. qapi-schema.json
  116. qdev-monitor.c
  117. qdict-test-data.txt
  118. qemu-bridge-helper.c
  119. qemu-char.c
  120. qemu-doc.texi
  121. qemu-ga.texi
  122. qemu-img-cmds.hx
  123. qemu-img.c
  124. qemu-img.texi
  125. qemu-io-cmds.c
  126. qemu-io.c
  127. qemu-nbd.c
  128. qemu-nbd.texi
  129. qemu-options-wrapper.h
  130. qemu-options.h
  131. qemu-options.hx
  132. qemu-seccomp.c
  133. qemu-tech.texi
  134. qemu-timer.c
  135. qemu.nsi
  136. qemu.sasl
  137. qmp-commands.hx
  138. qmp.c
  139. qtest.c
  140. README
  141. rules.mak
  142. softmmu_template.h
  143. spice-qemu-char.c
  144. tcg-runtime.c
  145. tci.c
  146. thread-pool.c
  147. thunk.c
  148. tpm.c
  149. trace-events
  150. translate-all.c
  151. translate-all.h
  152. translate-common.c
  153. user-exec.c
  154. VERSION
  155. version.rc
  156. vl.c
  157. xen-common-stub.c
  158. xen-common.c
  159. xen-hvm-stub.c
  160. xen-hvm.c
  161. xen-mapcache.c